BDBM50227913 CHEMBL431965
SMILES CCCCN(CCCC)C(=O)Nc1cccc(Cl)c1
InChI Key InChIKey=IOKBPHPZJHRVSD-UHFFFAOYSA-N
Data  2 IC50
  Tab Delimited (TSV)   2D SDfile   Computed 3D by Vconf -m prep SDfile
Find this compound or compounds like it in BindingDB:
Activity Spreadsheet -- Enzyme Inhibition Constant Data from BindingDB
Found 2 hits for monomerid = 50227913
TargetSterol O-acyltransferase 1(Rattus norvegicus)
American Cyanamid
Curated by ChEMBL
LigandPNGBDBM50227913(CHEMBL431965)
Affinity DataIC50:  9.54E+3nM. Assay description: In vitro inhibitory concentration against acyl coenzyme A:cholesterol acyltransferase derived from rat adrenals
In DepthDetails ArticlePubMed
TargetSterol O-acyltransferase 1(Homo sapiens (Human))
American Cyanamid
Curated by ChEMBL
LigandPNGBDBM50227913(CHEMBL431965)
Affinity DataIC50:  3.21E+4nM. Assay description: In vitro inhibitory concentration against acyl coenzyme A:cholesterol acyltransferase derived from smooth muscle cells from thoracic aorta of monkeys
In DepthDetails ArticlePubMed