BDBM50227935 CHEMBL75708
SMILES CCCCCCN(CCCCCC)C(=O)Nc1ccc(C)cc1C
InChI Key InChIKey=LHLUTNUKWMRWBI-UHFFFAOYSA-N
Data  1 IC50
  Tab Delimited (TSV)   2D SDfile   Computed 3D by Vconf -m prep SDfile
Find this compound or compounds like it in BindingDB:
Activity Spreadsheet -- Enzyme Inhibition Constant Data from BindingDB
Found 1 hit for monomerid = 50227935
TargetSterol O-acyltransferase 1(Rattus norvegicus)
American Cyanamid
Curated by ChEMBL
LigandPNGBDBM50227935(CHEMBL75708)
Affinity DataIC50:  330nM. Assay description: In vitro inhibitory concentration against Acyl coenzyme A:cholesterol acyltransferase derived from rat adrenals
In DepthDetails ArticlePubMed