BDBM50228438 3-(4-(2-amino-4-bromophenylthio)-3-((dimethylamino)methyl)phenoxy)propan-1-ol::CHEMBL397889
SMILES CN(C)Cc1cc(OCCCO)ccc1Sc1ccc(Br)cc1N
InChI Key InChIKey=CLVQITJMWWKDJN-UHFFFAOYSA-N
Data  3 KI
  Tab Delimited (TSV)   2D SDfile   Computed 3D by Vconf -m prep SDfile
Find this compound or compounds like it in BindingDB:
Activity Spreadsheet -- Enzyme Inhibition Constant Data from BindingDB
Found 3 hits for monomerid = 50228438
TargetSodium-dependent serotonin transporter(Homo sapiens (Human))
University Of Pennsylvania
Curated by ChEMBL
LigandPNGBDBM50228438(3-(4-(2-amino-4-bromophenylthio)-3-((dimethylamino...)
Affinity DataKi:  0.210nM. Assay description: Displacement of [125I]5-iodo-2-[[2,2-[(dimethylamino)methyl]phenyl]thio]benzyl alcohol from SERT expressed in LLCPK1 cells
In DepthDetails ArticlePubMed
TargetSodium-dependent noradrenaline transporter(Homo sapiens (Human))
University Of Pennsylvania
Curated by ChEMBL
LigandPNGBDBM50228438(3-(4-(2-amino-4-bromophenylthio)-3-((dimethylamino...)
Affinity DataKi:  279nM. Assay description: Displacement of [125I]-iodonisoxetine from NET expressed in LLCPK1 cells
In DepthDetails ArticlePubMed
TargetSodium-dependent dopamine transporter(Homo sapiens (Human))
University Of Pennsylvania
Curated by ChEMBL
LigandPNGBDBM50228438(3-(4-(2-amino-4-bromophenylthio)-3-((dimethylamino...)
Affinity DataKi: >1.00E+3nM. Assay description: Displacement of [125I]N-(3'-iodopropen-2'yl)-2-beta-carbomethoxy-3-beta-(4-chlorophenyl)tropane from DAT expressed in LLCPK1 cells
In DepthDetails ArticlePubMed