BDBM50228604 CHEMBL3350720
SMILES CCCC[C@H](NC(=O)[C@H](Cc1ccc(cc1)S(O)(=O)=O)NC(=O)OC(C)(C)C)C(=O)NCC(=O)N[C@@H](Cc1c[nH]c2ccccc12)C(=O)N[C@@H](CCCNC(=O)OCc1ccccc1)C(=O)N[C@@H](CC(O)=O)C(N)=O
InChI Key InChIKey=SEFUCQZYFVLWAR-HECCNADXSA-N
Data  2 KI
  Tab Delimited (TSV)   2D SDfile   Computed 3D by Vconf -m prep SDfile
Find this compound or compounds like it in BindingDB:
Activity Spreadsheet -- Enzyme Inhibition Constant Data from BindingDB
Found 2 hits for monomerid = 50228604
TargetGastrin/cholecystokinin type B receptor(Homo sapiens (Human))
University Of Paris
Curated by ChEMBL
LigandPNGBDBM50228604(CHEMBL3350720)
Affinity DataKi:  54nM. Assay description: Apparent affinity to inhibit binding of [3H]pCCK-8 to Cholecystokinin type B receptor of guinea pig brain membranes
In DepthDetails ArticlePubMed
TargetCholecystokinin receptor type A(Cavia porcellus)
University Of Paris
Curated by ChEMBL
LigandPNGBDBM50228604(CHEMBL3350720)
Affinity DataKi:  230nM. Assay description: Apparent affinity to inhibit binding of [3H]pCCK-8 to Cholecystokinin type A receptor of guinea pig pancreatic membranes
In DepthDetails ArticlePubMed