BDBM50228786 CHEMBL4065282
SMILES COCCN(CCOC)CC(=O)Nc1ccc(Nc2ncc(Cl)c(Nc3cccc(NC(=O)C=C)c3)n2)cc1OC
InChI Key InChIKey=QNDNRFWHIJPIJZ-UHFFFAOYSA-N
Data  1 IC50
  Tab Delimited (TSV)   2D SDfile   Computed 3D by Vconf -m prep SDfile
Find this compound or compounds like it in BindingDB:
Activity Spreadsheet -- Enzyme Inhibition Constant Data from BindingDB
Found 1 hit for monomerid = 50228786
TargetTyrosine-protein kinase BTK(Homo sapiens (Human))
Dalian Medical University
Curated by ChEMBL
LigandPNGBDBM50228786(CHEMBL4065282)
Affinity DataIC50: >100nM. Assay description: Inhibition of N-terminal His-tagged full length human recombinant BTK expressed in baculovirus infected Sf9 insect cells using Poly (4:1 Glu, Tyr) pe...
In DepthDetails ArticlePubMed