BDBM50228876 CHEMBL555954
SMILES Cl.Cc1cc(C)n(n1)-c1[nH]nc(NN)c2c1nc1ccccc21
InChI Key InChIKey=HILWVFRASMPRPU-UHFFFAOYSA-N
Data  1 IC50
  Tab Delimited (TSV)   2D SDfile   Computed 3D by Vconf -m prep SDfile
Find this compound or compounds like it in BindingDB:
Activity Spreadsheet -- Enzyme Inhibition Constant Data from BindingDB
Found 1 hit for monomerid = 50228876
TargetcAMP-specific 3',5'-cyclic phosphodiesterase 4A/4B/4C/4D(Homo sapiens (Human))
Universidad De Navarra
Curated by ChEMBL
LigandPNGBDBM50228876(CHEMBL555954)
Affinity DataIC50:  3.48E+5nM. Assay description: Inhibition of canine heart phosphodiesterase 4
In DepthDetails ArticlePubMed