BDBM50229032 CHEMBL114341
SMILES [H][C@@]12CC(=C)CC[C@@]1([H])C(C)(C)Oc1cc(CCC)cc(O)c21
InChI Key InChIKey=ZCVYXVHFOBOOMS-HUUCEWRRSA-N
Data  1 IC50
  Tab Delimited (TSV)   2D SDfile   Computed 3D by Vconf -m prep SDfile
Find this compound or compounds like it in BindingDB:
Activity Spreadsheet -- Enzyme Inhibition Constant Data from BindingDB
Found 1 hit for monomerid = 50229032
TargetCannabinoid receptor 1/2(Rattus norvegicus (Rat))
Virginia Commonwealth University
Curated by ChEMBL
LigandPNGBDBM50229032(CHEMBL114341)
Affinity DataIC50:  1.40E+3nM. Assay description: The compound was tested in vitro for binding activity against THC cannabinoid receptor site, using 3H-CP-55940 as the radioligand
In DepthDetails ArticlePubMed