BDBM50229039 CHEMBL351568
SMILES COC(=O)c1cccc(c1)-n1c2ccccc2c(=O)n(Cc2ccccc2)c1=O
InChI Key InChIKey=XYCILAGNHIWZRO-UHFFFAOYSA-N
Data  2 IC50
  Tab Delimited (TSV)   2D SDfile   Computed 3D by Vconf -m prep SDfile
Find this compound or compounds like it in BindingDB:
Activity Spreadsheet -- Enzyme Inhibition Constant Data from BindingDB
Found 2 hits for monomerid = 50229039
TargetcAMP-specific 3',5'-cyclic phosphodiesterase 4C(Rattus norvegicus)
Pfizer
Curated by ChEMBL
LigandPNGBDBM50229039(CHEMBL351568)
Affinity DataIC50:  180nM. Assay description: Displacement of [3H]rolipram binding to Phosphodiesterase 4 in rat brain
In DepthDetails ArticlePubMed
TargetcAMP-specific 3',5'-cyclic phosphodiesterase 4C(Rattus norvegicus)
Pfizer
Curated by ChEMBL
LigandPNGBDBM50229039(CHEMBL351568)
Affinity DataIC50:  1.00E+3nM. Assay description: Inhibition of phosphodiesterase 4 from rat brain cortex
In DepthDetails ArticlePubMed