BDBM50229043 CHEMBL2051969
SMILES Nc1ncnc2n(cnc12)[C@@H]1O\C(=C/F)[C@@H](O)[C@@H]1O
InChI Key InChIKey=NAWIFPQLACUTSO-MXGDDHKLSA-N
Data  1 KI
  Tab Delimited (TSV)   2D SDfile   Computed 3D by Vconf -m prep SDfile
Find this compound or compounds like it in BindingDB:
Activity Spreadsheet -- Enzyme Inhibition Constant Data from BindingDB
Found 1 hit for monomerid = 50229043
TargetAdenosylhomocysteinase(Rattus norvegicus)
Merrell Dow Research Institute
Curated by ChEMBL
LigandPNGBDBM50229043(CHEMBL2051969)
Affinity DataKi:  1.10E+4nM. Assay description: Competitive inhibitory activity against rat liver S-Adenosyl-homocysteine hydrolase
In DepthDetails ArticlePubMed