BDBM50229188 CHEMBL4096996
SMILES CC(C)N(C(C)C)C(=O)N(C)Cc1cc(F)cc(F)c1F
InChI Key InChIKey=RESQIMKKDLPZLK-UHFFFAOYSA-N
Data  1 EC50
  Tab Delimited (TSV)   2D SDfile   Computed 3D by Vconf -m prep SDfile
Find this compound or compounds like it in BindingDB:
Activity Spreadsheet -- Enzyme Inhibition Constant Data from BindingDB
Found 1 hit for monomerid = 50229188
TargetReceptor-interacting serine/threonine-protein kinase 1(Homo sapiens (Human))
National Institute Of Biological Sciences
Curated by ChEMBL
LigandPNGBDBM50229188(CHEMBL4096996)
Affinity DataEC50: >3.00E+3nM. Assay description: Inhibition of RIP1 in human HT-29 cells assessed as reduction in TNFalpha/z-VAD-FMK-induced necrosis after 24 hrs by Cell Titer-Glo luminescent cell ...
In DepthDetails ArticlePubMed