BDBM50229346 CHEMBL74425
SMILES CC(C#CCn1ccnc1)N1CCN(C)C1=O
InChI Key InChIKey=ZREJTOFRAVTSBM-UHFFFAOYSA-N
Data  2 KI
  Tab Delimited (TSV)   2D SDfile   Computed 3D by Vconf -m prep SDfile
Find this compound or compounds like it in BindingDB:
Activity Spreadsheet -- Enzyme Inhibition Constant Data from BindingDB
Found 2 hits for monomerid = 50229346
LigandPNGBDBM50229346(CHEMBL74425)
Affinity DataKi:  120nM. Assay description: Binding affinity to muscarinic acetylcholine receptor was determined in presence of [3H]OXO-M radioligand (in vitro)
In DepthDetails ArticlePubMed
LigandPNGBDBM50229346(CHEMBL74425)
Affinity DataKi:  4.01E+3nM. Assay description: Binding affinity to muscarinic acetylcholine receptor was determined in presence of [3H]QNB radioligand (in vitro)
In DepthDetails ArticlePubMed