BDBM50229612 CHEMBL304608
SMILES Ic1cccc(c1)C(=O)NCC\N=C(\NCCCCOc1cccc(CN2CCCCC2)c1)NC#N
InChI Key InChIKey=GOSIDFUWXOVALS-UHFFFAOYSA-N
Data  1 KI
  Tab Delimited (TSV)   2D SDfile   Computed 3D by Vconf -m prep SDfile
Find this compound or compounds like it in BindingDB:
Activity Spreadsheet -- Enzyme Inhibition Constant Data from BindingDB
Found 1 hit for monomerid = 50229612
TargetHistamine H2 receptor(Cavia porcellus (domestic guinea pig))
Freie Universit£T Berlin
Curated by ChEMBL
LigandPNGBDBM50229612(CHEMBL304608)
Affinity DataKi:  5.20nM. Assay description: Inhibition of [125I]APT binding to H2 receptors in guinea pig cerebral membranes.
In DepthDetails ArticlePubMed