BDBM50229761 CHEMBL314337::L-689037
SMILES CC(C)(C)CC(=O)c1c(CC(C)(C)C(O)=O)n(Cc2ccc(Cl)cc2)c2ccc(OCc3ccc4ccccc4n3)cc12
InChI Key InChIKey=IUHIISLXVJPCRU-UHFFFAOYSA-N
Data  1 IC50
  Tab Delimited (TSV)   2D SDfile   Computed 3D by Vconf -m prep SDfile
Find this compound or compounds like it in BindingDB:
Activity Spreadsheet -- Enzyme Inhibition Constant Data from BindingDB
Found 1 hit for monomerid = 50229761
TargetProstaglandin G/H synthase 1/2(Homo sapiens (Human))
Wyeth-Ayerst Research
Curated by ChEMBL
LigandPNGBDBM50229761(CHEMBL314337 | L-689037)
Affinity DataIC50:  2nM. Assay description: The compound was tested for inhibitory activity against Prostaglandin G/H synthase in human polymorphonuclear leukocytes[PMNS]
In DepthDetails ArticlePubMed