BDBM50229839 CHEMBL91622
SMILES CCCCCCCCCCCCOC(=O)CCC(=O)Nc1nnc(s1)S(N)(=O)=O
InChI Key InChIKey=PYOZIMVICZRNLM-UHFFFAOYSA-N
Data  1 IC50
  Tab Delimited (TSV)   2D SDfile   Computed 3D by Vconf -m prep SDfile
Find this compound or compounds like it in BindingDB:
Activity Spreadsheet -- Enzyme Inhibition Constant Data from BindingDB
Found 1 hit for monomerid = 50229839
TargetCarbonic anhydrase 1/12/13/14/2/3/4/5A, mitochondrial/5B, mitochondrial/6/7/9(Homo sapiens (Human))
Istituto Chimico Internazionale Dr. G. Rende
Curated by ChEMBL
LigandPNGBDBM50229839(CHEMBL91622)
Affinity DataIC50:  520nM. Assay description: Inhibition of Carbonic anhydrase enzyme in rabbits
In DepthDetails ArticlePubMed