BDBM50229904 CHEMBL87465
SMILES Cc1cc(N)c2cc(NC(=O)\C=C\c3c(Cl)cccc3Cl)ccc2n1
InChI Key InChIKey=UIRKQLPJWDHWTE-SOFGYWHQSA-N
Data  1 IC50  1 EC50
  Tab Delimited (TSV)   2D SDfile   Computed 3D by Vconf -m prep SDfile
Find this compound or compounds like it in BindingDB:
Activity Spreadsheet -- Enzyme Inhibition Constant Data from BindingDB
Found 2 hits for monomerid = 50229904
TargetMyeloperoxidase(Homo sapiens (Human))
Merck Sharp And Dohme Research Laboratories
Curated by ChEMBL
LigandPNGBDBM50229904(CHEMBL87465)
Affinity DataEC50: <3.00E+3nM. Assay description: Compound was tested for the induction of nonspecific myeloperoxidase (MPO) release
In DepthDetails ArticlePubMed
TargetC5a anaphylatoxin chemotactic receptor 1(Homo sapiens (Human))
Merck Sharp And Dohme Research Laboratories
Curated by ChEMBL
LigandPNGBDBM50229904(CHEMBL87465)
Affinity DataIC50:  2.14E+4nM. Assay description: Ability to inhibit binding of radiolabeled C5a anaphylatoxin to intact membrane bound receptor from human neutrophils.
In DepthDetails ArticlePubMed