BDBM50230019 CHEMBL4085018
SMILES CC(C)C[C@@H]1NC(=O)[C@H](CCC(N)=O)NC(=O)[C@H](CCCNC(N)=N)NC(=O)[C@@H]2CSCCC(=O)N3CN(CN(C3)C(=O)CCSC[C@H](NC(=O)[C@@H](N)CCCNC(N)=N)C(=O)N[C@@H](Cc3ccncc3)C(=O)N[C@@H](CCCNC(N)=N)C(=O)N[C@@H](CC(C)C)C(=O)N3CCC[C@H]3C(=O)N2)C(=O)CCSC[C@H](NC(=O)[C@H](CCCNC(N)=N)NC1=O)C(=O)N[C@@H](CCCNC(N)=N)C(=O)N[C@@H](Cc1c[nH]c2ccccc12)C(O)=O
InChI Key InChIKey=JLUOXLCOHVBMLM-DTHCQXTISA-N
Data  1 KI
  Tab Delimited (TSV)   2D SDfile   Computed 3D by Vconf -m prep SDfile
Find this compound or compounds like it in BindingDB:
Activity Spreadsheet -- Enzyme Inhibition Constant Data from BindingDB
Found 1 hit for monomerid = 50230019
TargetCoagulation factor XII(Homo sapiens (Human))
Ecole Polytechnique F�D�Rale De Lausanne (Epfl)
Curated by ChEMBL
LigandPNGBDBM50230019(CHEMBL4085018)
Affinity DataKi:  57nM. Assay description: Inhibition of human beta factor 12a using fluorogenic substrate Boc-Gln-Gly-Arg-AMC preincubated for 10 mins followed by addition of substrate measur...
In DepthDetails ArticlePubMed