BDBM50230043 CHEMBL125978
SMILES [Na+].CC(Oc1cccc(c1)C(\C)=C/c1ccc2ccc(Cl)cc2n1)C([O-])=O
InChI Key InChIKey=UXUFBAAHJHLDPK-ALUHPYBCSA-M
Data  1 IC50
  Tab Delimited (TSV)   2D SDfile   Computed 3D by Vconf -m prep SDfile
Find this compound or compounds like it in BindingDB:
Activity Spreadsheet -- Enzyme Inhibition Constant Data from BindingDB
Found 1 hit for monomerid = 50230043
TargetCysteinyl leukotriene receptor 1/2(Homo sapiens (Human))
Merck Frosst Centre For Therapeutic Research
Curated by ChEMBL
LigandPNGBDBM50230043(CHEMBL125978)
Affinity DataIC50:  495nM. Assay description: Inhibition of human carbonic anhydrase II
In DepthDetails ArticlePubMed