BDBM50230215 CHEMBL543683
SMILES Cl.NS(=O)(=O)OCCCOc1ccc(cc1)-n1ccnc1
InChI Key InChIKey=IPTAEZFXWLKDLE-UHFFFAOYSA-N
Data  1 IC50
  Tab Delimited (TSV)   2D SDfile   Computed 3D by Vconf -m prep SDfile
Find this compound or compounds like it in BindingDB:
Activity Spreadsheet -- Enzyme Inhibition Constant Data from BindingDB
Found 1 hit for monomerid = 50230215
TargetCarbonic anhydrase 6(Bos taurus)
A.H. Robins
Curated by ChEMBL
LigandPNGBDBM50230215(CHEMBL543683)
Affinity DataIC50:  250nM. Assay description: Bovine erythrocyte carbonic anhydrase inhibitory activity of the compound.
In DepthDetails ArticlePubMed