BDBM50230612 CHEMBL9845
SMILES COc1ccnc(C[S+]([O-])c2nc3cc(F)c(OC(F)F)cc3[nH]2)c1OC
InChI Key InChIKey=JJMRIVJWKKGUPD-UHFFFAOYSA-N
Data  1 IC50
  Tab Delimited (TSV)   2D SDfile   Computed 3D by Vconf -m prep SDfile
Find this compound or compounds like it in BindingDB:
Activity Spreadsheet -- Enzyme Inhibition Constant Data from BindingDB
Found 1 hit for monomerid = 50230612
TargetPotassium-transporting ATPase alpha chain 1/subunit beta(Homo sapiens (Human))
Byk Gulden Pharmaceuticals
Curated by ChEMBL
LigandPNGBDBM50230612(CHEMBL9845)
Affinity DataIC50:  7.94E+3nM. Assay description: In vitro evaluation for the inhibition of H+/K+ ATPase at pH < 3 in the gastric glands of isolated rabbit stomach.
In DepthDetails ArticlePubMed