BDBM50230619 CHEMBL9768
SMILES COc1cnc(C[S+]([O-])c2nc3cc4OC(F)(F)Oc4cc3[nH]2)cc1OC
InChI Key InChIKey=AAJYURZARXDQCX-UHFFFAOYSA-N
Data  1 IC50
  Tab Delimited (TSV)   2D SDfile   Computed 3D by Vconf -m prep SDfile
Find this compound or compounds like it in BindingDB:
Activity Spreadsheet -- Enzyme Inhibition Constant Data from BindingDB
Found 1 hit for monomerid = 50230619
TargetPotassium-transporting ATPase alpha chain 1/subunit beta(Homo sapiens (Human))
Byk Gulden Pharmaceuticals
Curated by ChEMBL
LigandPNGBDBM50230619(CHEMBL9768)
Affinity DataIC50:  6.31E+4nM. Assay description: In vitro evaluation for the inhibition of H+/K+ ATPase at pH < 3 in the gastric glands of isolated rabbit stomach.
In DepthDetails ArticlePubMed