BDBM50233719 5-cyano-N-(2-(4-methylpiperidin-1-yl)-4-morpholinophenyl)furan-2-carboxamide::CHEMBL254496
SMILES CC1CCN(CC1)c1cc(ccc1NC(=O)c1ccc(o1)C#N)N1CCOCC1
InChI Key InChIKey=FAGARJGZRYAALA-UHFFFAOYSA-N
Data  1 IC50
  Tab Delimited (TSV)   2D SDfile   Computed 3D by Vconf -m prep SDfile
Find this compound or compounds like it in BindingDB:
Activity Spreadsheet -- Enzyme Inhibition Constant Data from BindingDB
Found 1 hit for monomerid = 50233719
TargetMacrophage colony-stimulating factor 1 receptor(Homo sapiens (Human))
Johnson & Johnson Pharmaceutical Research & Development
Curated by ChEMBL
LigandPNGBDBM50233719(5-cyano-N-(2-(4-methylpiperidin-1-yl)-4-morpholino...)
Affinity DataIC50:  11nM. Assay description: Inhibition of human cytoplasmic FMS expressed in Sf9-baculovirus system after 80 mins by fluorescence polarization
In DepthDetails ArticlePubMed