BDBM50233820 CHEMBL4104607::US11021454, Compound 6d
SMILES OC(=O)[C@H](Cc1ccccc1)NC(=O)\C=C\c1ccc(O)c2oc(cc12)-c1ccc(O)c(O)c1
InChI Key InChIKey=GLHGNYCDYVAOMD-BLRBJFNZSA-N
Data  3 IC50
  Tab Delimited (TSV)   2D SDfile   Computed 3D by Vconf -m prep SDfile
Find this compound or compounds like it in BindingDB:
Activity Spreadsheet -- Enzyme Inhibition Constant Data from BindingDB
Found 3 hits for monomerid = 50233820
TargetXanthine dehydrogenase/oxidase(Homo sapiens (Human))
China Pharmaceutical University
Curated by ChEMBL
LigandPNGBDBM50233820(CHEMBL4104607 | US11021454, Compound 6d)
Affinity DataIC50:  6.04E+3nM. Assay description: Inhibition of Xanthine oxidase (unknown origin) using xanthine as substrate preincubated for 3 mins followed by substrate addition measured every 15 ...
In DepthDetails ArticlePubMed
TargetXanthine dehydrogenase/oxidase(Homo sapiens (Human))
China Pharmaceutical University
Curated by ChEMBL
LigandPNGBDBM50233820(CHEMBL4104607 | US11021454, Compound 6d)
Affinity DataIC50:  4.20E+3nM. Assay description: 12.1 Preparation of Reagents and Standard Solutions(1) Preparation of DPPH solution: accurately weigh the appropriate amount of DPPH, add MeOH and pe...
In DepthDetails US Patent
TargetXanthine dehydrogenase/oxidase(Homo sapiens (Human))
China Pharmaceutical University
Curated by ChEMBL
LigandPNGBDBM50233820(CHEMBL4104607 | US11021454, Compound 6d)
Affinity DataIC50:  6.04E+3nM. Assay description: 11.1 Preparation of Reagents and Standard Solutions(1) 75 mM phosphate buffer (PB, pH 7.4): containing KH2PO4 0.0956 g, K2HPO4 0.6946 g, EDTA 1.862 m...
In DepthDetails US Patent