BDBM50236368 (R)-2-(4-(1-(3-fluorobenzyl)-1H-indazol-5-ylamino)quinazolin-5-yloxy)-1-morpholinopropan-1-one::CHEMBL439425
SMILES C[C@@H](Oc1cccc2ncnc(Nc3ccc4n(Cc5cccc(F)c5)ncc4c3)c12)C(=O)N1CCOCC1
InChI Key InChIKey=PJOBQWOUMSIZKE-LJQANCHMSA-N
Data  1 IC50
  Tab Delimited (TSV)   2D SDfile   Computed 3D by Vconf -m prep SDfile
Find this compound or compounds like it in BindingDB:
Activity Spreadsheet -- Enzyme Inhibition Constant Data from BindingDB
Found 1 hit for monomerid = 50236368
TargetReceptor tyrosine-protein kinase erbB-2(Homo sapiens (Human))
Astrazeneca
Curated by ChEMBL
LigandPNGBDBM50236368((R)-2-(4-(1-(3-fluorobenzyl)-1H-indazol-5-ylamino)...)
Affinity DataIC50:  22nM. Assay description: Inhibition of human erbB2 autophosphorylation in MCF7 cells
In DepthDetails ArticlePubMed