BDBM50236725 CHEMBL4061726
SMILES CNC(C)C(=O)c1ccc(cc1)C(F)(F)F
InChI Key InChIKey=QLAWAIJPXNKWGH-UHFFFAOYSA-N
Data  2 EC50
  Tab Delimited (TSV)   2D SDfile   Computed 3D by Vconf -m prep SDfile
Find this compound or compounds like it in BindingDB:
Activity Spreadsheet -- Enzyme Inhibition Constant Data from BindingDB
Found 2 hits for monomerid = 50236725
TargetSodium-dependent serotonin transporter(Homo sapiens (Human))
Virginia Commonwealth University
Curated by ChEMBL
LigandPNGBDBM50236725(CHEMBL4061726)
Affinity DataEC50:  190nM. Assay description: Activity at SERT (unknown origin) assessed as release of [3H]HT
In DepthDetails ArticlePubMed
TargetSodium-dependent dopamine transporter(Homo sapiens (Human))
Virginia Commonwealth University
Curated by ChEMBL
LigandPNGBDBM50236725(CHEMBL4061726)
Affinity DataEC50:  2.70E+3nM. Assay description: Activity at DAT (unknown origin) assessed as release of [3H]DA
In DepthDetails ArticlePubMed