BDBM50236794 CHEMBL4081828
SMILES [H][C@]12C[C@]1([C@@H](O)[C@@H](O)[C@@H]2n1cnc2c(NC)nc(nc12)C#Cc1ccc(Cl)s1)C(=O)NCCN
InChI Key InChIKey=WEUXHMZSSMXXPN-RUZZFIIFSA-N
Data  3 KI  1 EC50
  Tab Delimited (TSV)   2D SDfile   Computed 3D by Vconf -m prep SDfile
Find this compound or compounds like it in BindingDB:
Activity Spreadsheet -- Enzyme Inhibition Constant Data from BindingDB
Found 4 hits for monomerid = 50236794
TargetTransmembrane domain-containing protein TMIGD3(Homo sapiens (Human))
National Institute Of Diabetes And Digestive And Kidney Diseases
Curated by ChEMBL
LigandPNGBDBM50236794(CHEMBL4081828)
Affinity DataKi:  156nM. Assay description: Concentration required to inhibit binding of ICAM-1 to LFA-1 (Leukocyte function-associated antigen-1), evaluated ELISA
In DepthDetails ArticlePubMed
TargetSodium-dependent serotonin transporter(Homo sapiens (Human))
National Institute Of Diabetes And Digestive And Kidney Diseases
Curated by ChEMBL
LigandPNGBDBM50236794(CHEMBL4081828)
Affinity DataKi: <1.00E+4nM. Assay description: Inhibition of [125I]RTI-55 binding to recombinant human SERT expressed in HEK293 cell membranes preincubated for 10 mins followed by radioligand addi...
In DepthDetails ArticlePubMed
TargetSodium-dependent serotonin transporter(Homo sapiens (Human))
National Institute Of Diabetes And Digestive And Kidney Diseases
Curated by ChEMBL
LigandPNGBDBM50236794(CHEMBL4081828)
Affinity DataKi: <1.00E+4nM. Assay description: Concentration required to inhibit binding of ICAM-1 to LFA-1 (Leukocyte function-associated antigen-1), evaluated ELISA
In DepthDetails ArticlePubMed
TargetSodium-dependent dopamine transporter(Homo sapiens (Human))
National Institute Of Diabetes And Digestive And Kidney Diseases
Curated by ChEMBL
LigandPNGBDBM50236794(CHEMBL4081828)
Affinity DataEC50: >1.00E+3nM. Assay description: mu-2 receptor binding affinity in rat brain by 3H [d-Ala2, (N-Me)Phe4, Gly5-ol] enkephalin displacement.
In DepthDetails ArticlePubMed