BDBM50237066 2-(3-cyanophenoxy)-N-(6-(3,5-dimethyl-1H-pyrazol-1-yl)-2-(5-methylfuran-2-yl)pyrimidin-4-yl)acetamide::CHEMBL402904
SMILES Cc1cc(C)n(n1)-c1cc(NC(=O)COc2cccc(c2)C#N)nc(n1)-c1ccc(C)o1
InChI Key InChIKey=IMNOAYWUEQMUEH-UHFFFAOYSA-N
Data  2 KI
  Tab Delimited (TSV)   2D SDfile   Computed 3D by Vconf -m prep SDfile
Find this compound or compounds like it in BindingDB:
Activity Spreadsheet -- Enzyme Inhibition Constant Data from BindingDB
Found 2 hits for monomerid = 50237066
TargetAdenosine receptor A2a(Homo sapiens (Human))
Neurocrine Biosciences
Curated by ChEMBL
LigandPNGBDBM50237066(2-(3-cyanophenoxy)-N-(6-(3,5-dimethyl-1H-pyrazol-1...)
Affinity DataKi: >1.00E+4nM. Assay description: Displacement of [3H]-ZM241385 from human adenosine A2A receptor expressed in HEK293 cells
In DepthDetails ArticlePubMed
TargetAdenosine receptor A1(Homo sapiens (Human))
Neurocrine Biosciences
Curated by ChEMBL
LigandPNGBDBM50237066(2-(3-cyanophenoxy)-N-(6-(3,5-dimethyl-1H-pyrazol-1...)
Affinity DataKi:  2.50E+4nM. Assay description: Displacement of [3H]-DPCPX from human adenosine A1 receptor expressed in HEK293 cells
In DepthDetails ArticlePubMed