BDBM50237086 CHEMBL256327::N-(6-(3,5-dimethyl-1H-pyrazol-1-yl)-2-(5-methylfuran-2-yl)pyrimidin-4-yl)-2-(3-fluoro-5-(morpholinomethyl)phenoxy)acetamide
SMILES Cc1cc(C)n(n1)-c1cc(NC(=O)COc2cc(F)cc(CN3CCOCC3)c2)nc(n1)-c1ccc(C)o1
InChI Key InChIKey=UAMWVBDBNFYGKK-UHFFFAOYSA-N
Data  2 KI
  Tab Delimited (TSV)   2D SDfile   Computed 3D by Vconf -m prep SDfile
Find this compound or compounds like it in BindingDB:
Activity Spreadsheet -- Enzyme Inhibition Constant Data from BindingDB
Found 2 hits for monomerid = 50237086
TargetAdenosine receptor A2a(Homo sapiens (Human))
Neurocrine Biosciences
Curated by ChEMBL
LigandPNGBDBM50237086(CHEMBL256327 | N-(6-(3,5-dimethyl-1H-pyrazol-1-yl)...)
Affinity DataKi:  1.40nM. Assay description: Displacement of [3H]-ZM241385 from human adenosine A2A receptor expressed in HEK293 cells
In DepthDetails ArticlePubMed
TargetAdenosine receptor A1(Homo sapiens (Human))
Neurocrine Biosciences
Curated by ChEMBL
LigandPNGBDBM50237086(CHEMBL256327 | N-(6-(3,5-dimethyl-1H-pyrazol-1-yl)...)
Affinity DataKi:  480nM. Assay description: Displacement of [3H]-DPCPX from human adenosine A1 receptor expressed in HEK293 cells
In DepthDetails ArticlePubMed