BDBM50237772 CHEMBL4069499
SMILES CNC(=O)[C@H]1[Se][C@H]([C@H](O)[C@@H]1O)n1cnc2c(N[C@@H]3C[C@H]3c3ccccc3)ncnc12
InChI Key InChIKey=RYCMKNGQAIESMF-OKLOZOLHSA-N
Data  3 KI
  Tab Delimited (TSV)   2D SDfile   Computed 3D by Vconf -m prep SDfile
Find this compound or compounds like it in BindingDB:
Activity Spreadsheet -- Enzyme Inhibition Constant Data from BindingDB
Found 3 hits for monomerid = 50237772
TargetAdenosine receptor A3(Homo sapiens (Human))
Seoul National University
Curated by ChEMBL
LigandPNGBDBM50237772(CHEMBL4069499)
Affinity DataKi:  3.90nM. Assay description: Displacement of [125I]I-AB-MECA from human adenosine A3 receptor expressed in CHO cells after 60 mins by gamma counting analysis
In DepthDetails ArticlePubMed
TargetAdenosine receptor A1(Homo sapiens (Human))
Seoul National University
Curated by ChEMBL
LigandPNGBDBM50237772(CHEMBL4069499)
Affinity DataKi:  420nM. Assay description: Displacement of [3H]R-PLA from human adenosine A1 receptor expressed in CHO cells after 60 mins by liquid scintillation analyzer
In DepthDetails ArticlePubMed
TargetAdenosine receptor A2a(Homo sapiens (Human))
Seoul National University
Curated by ChEMBL
LigandPNGBDBM50237772(CHEMBL4069499)
Affinity DataKi:  2.48E+3nM. Assay description: Displacement of [3H]CGS21680 from human adenosine A2A receptor expressed in HEK293 cells after 60 mins by liquid scintillation analyzer
In DepthDetails ArticlePubMed