BDBM50241156 (Z)-5-(4'-Methylbenzylidene)-2-thioxothiazolidin-4-one::(Z)-5-(4-methylbenzyliden)-2-thioxothiazolidin-4-one::CHEMBL224172
SMILES Cc1ccc(C=C2SC(S)=NC2=O)cc1
InChI Key InChIKey=RAXPMQHOSGNELK-UHFFFAOYSA-N
Data  1 IC50
  Tab Delimited (TSV)   2D SDfile   Computed 3D by Vconf -m prep SDfile
Find this compound or compounds like it in BindingDB:
Activity Spreadsheet -- Enzyme Inhibition Constant Data from BindingDB
Found 1 hit for monomerid = 50241156
TargetArylamine N-acetyltransferase 1(Homo sapiens (Human))
University Of Oxford
Curated by ChEMBL
LigandPNGBDBM50241156((Z)-5-(4'-Methylbenzylidene)-2-thioxothiazolidin-4...)
Affinity DataIC50: >3.00E+4nM. Assay description: Inhibition of human recombinant NAT1 assessed as hydrolysis of acetyl coA using PABA as substrate by Ellman's method
In DepthDetails ArticlePubMed