BDBM50241784 6-O-benzoyl polygolitosyl-(2->1)-alpha-galactose::CHEMBL463000
SMILES OC[C@@H]1OC[C@@H](O[C@@H]2O[C@@H](COCc3ccccc3)[C@@H](O)[C@@H](O)[C@@H]2O)[C@H](O)[C@H]1O
InChI Key InChIKey=JDGKZYSACWLQKT-RBRZPYPVSA-N
Data  1 IC50
  Tab Delimited (TSV)   2D SDfile   Computed 3D by Vconf -m prep SDfile
Find this compound or compounds like it in BindingDB:
Activity Spreadsheet -- Enzyme Inhibition Constant Data from BindingDB
Found 1 hit for monomerid = 50241784
TargetSodium-dependent noradrenaline transporter(Homo sapiens (Human))
Medical And Pharmaceutical Industry Technology And Development Center
Curated by ChEMBL
LigandPNGBDBM50241784(6-O-benzoyl polygolitosyl-(2->1)-alpha-galactose |...)
Affinity DataIC50:  3.00E+4nM. Assay description: Displacement of [125I]RTI-55 from human NET expressed in MDCK cell membrane
In DepthDetails ArticlePubMed