BDBM50243333 1-(3-carbamoyl-5-(4-(2-(dimethylamino)ethoxy)phenyl)thiophen-2-yl)urea::CHEMBL452021
SMILES CN(C)CCOc1ccc(cc1)-c1cc(C(N)=O)c(NC(N)=O)s1
InChI Key InChIKey=RFSVVCBVIFWEMZ-UHFFFAOYSA-N
Data  2 IC50
PDB links: 1 PDB ID matches this monomer.
  Tab Delimited (TSV)   2D SDfile   Computed 3D by Vconf -m prep SDfile
Find this compound or compounds like it in BindingDB:
Activity Spreadsheet -- Enzyme Inhibition Constant Data from BindingDB
Found 2 hits for monomerid = 50243333
TargetSerine/threonine-protein kinase Chk1(Homo sapiens (Human))
Astrazeneca R&D Boston
Curated by ChEMBL
LigandPNGBDBM50243333(1-(3-carbamoyl-5-(4-(2-(dimethylamino)ethoxy)pheny...)
Affinity DataIC50:  150nM. Assay description: Inhibition of Chk1
TargetSerine/threonine-protein kinase Chk1(Homo sapiens (Human))
Astrazeneca R&D Boston
Curated by ChEMBL
LigandPNGBDBM50243333(1-(3-carbamoyl-5-(4-(2-(dimethylamino)ethoxy)pheny...)
Affinity DataIC50:  150nM. Assay description: Inhibition of Chk1