BDBM50243488 (S)-5-amino-2-(2-(3-(2-chloro-6-methylphenyl)ureido)-2-naphthamido)-5-oxopentanoic acid::CHEMBL517112
SMILES Cc1cccc(Cl)c1NC(=O)Nc1cc2ccccc2cc1C(=O)N[C@@H](CCC(N)=O)C(O)=O
InChI Key InChIKey=NSZHCTYAIAGPJM-SFHVURJKSA-N
Data  1 IC50
  Tab Delimited (TSV)   2D SDfile   Computed 3D by Vconf -m prep SDfile
Find this compound or compounds like it in BindingDB:
Activity Spreadsheet -- Enzyme Inhibition Constant Data from BindingDB
Found 1 hit for monomerid = 50243488
TargetGlycogen phosphorylase, liver form(Homo sapiens (Human))
Glaxosmithkline
Curated by ChEMBL
LigandPNGBDBM50243488((S)-5-amino-2-(2-(3-(2-chloro-6-methylphenyl)ureid...)
Affinity DataIC50:  1.30E+3nM. Assay description: Inhibition of human glycogen phosphorylase alpha
In DepthDetails ArticlePubMed