BDBM50243489 (S)-6-amino-2-(2-(3-(2-chloro-6-methylphenyl)ureido)-2-naphthamido)hexanoic acid::CHEMBL460877
SMILES Cc1cccc(Cl)c1NC(=O)Nc1cc2ccccc2cc1C(=O)N[C@@H](CCCCN)C(O)=O
InChI Key InChIKey=FETTYSDEBMZFTP-FQEVSTJZSA-N
Data  2 IC50
  Tab Delimited (TSV)   2D SDfile   Computed 3D by Vconf -m prep SDfile
Find this compound or compounds like it in BindingDB:
Activity Spreadsheet -- Enzyme Inhibition Constant Data from BindingDB
Found 2 hits for monomerid = 50243489
TargetGlycogen phosphorylase, liver form(Homo sapiens (Human))
Glaxosmithkline
Curated by ChEMBL
LigandPNGBDBM50243489((S)-6-amino-2-(2-(3-(2-chloro-6-methylphenyl)ureid...)
Affinity DataIC50: >1.00E+4nM. Assay description: Inhibition of human glycogen phosphorylase alpha in HepG2 cells assessed as inhibition of forskolin-induced glycogenolysis after 60 mins
In DepthDetails ArticlePubMed
TargetGlycogen phosphorylase, liver form(Homo sapiens (Human))
Glaxosmithkline
Curated by ChEMBL
LigandPNGBDBM50243489((S)-6-amino-2-(2-(3-(2-chloro-6-methylphenyl)ureid...)
Affinity DataIC50:  3.00E+3nM. Assay description: Inhibition of human glycogen phosphorylase alpha
In DepthDetails ArticlePubMed