BDBM50243726 (7R,9S)-7-(((3S,4R)-3-methyl-4-o-tolylpiperidin-1-yl)methyl)-6,7,8,9-tetrahydro-5H-cyclohepta[b]pyridin-9-ol::CHEMBL511658
SMILES C[C@@H]1CN(C[C@@H]2CCc3cccnc3[C@@H](O)C2)CC[C@H]1c1ccccc1C
InChI Key InChIKey=OASYXJZGABKMRD-NNLJWKLDSA-N
Data  1 KI  2 IC50
  Tab Delimited (TSV)   2D SDfile   Computed 3D by Vconf -m prep SDfile
Find this compound or compounds like it in BindingDB:
Activity Spreadsheet -- Enzyme Inhibition Constant Data from BindingDB
Found 3 hits for monomerid = 50243726
TargetNociceptin receptor(Homo sapiens (Human))
Tsukuba Research Institute
Curated by ChEMBL
LigandPNGBDBM50243726((7R,9S)-7-(((3S,4R)-3-methyl-4-o-tolylpiperidin-1-...)
Affinity DataKi:  3.5nM. Assay description: Displacement of [125I][Tyr14]nociceptin from human ORL1 expressed in CHO cells
In DepthDetails ArticlePubMed
TargetPotassium voltage-gated channel subfamily H member 2(Homo sapiens (Human))
Tsukuba Research Institute
Curated by ChEMBL
LigandPNGBDBM50243726((7R,9S)-7-(((3S,4R)-3-methyl-4-o-tolylpiperidin-1-...)
Affinity DataIC50:  9.20E+3nM. Assay description: Displacement of [35S]MK499 from human ERG K+ channel expressed in HEK293 cells
In DepthDetails ArticlePubMed
TargetNociceptin receptor(Homo sapiens (Human))
Tsukuba Research Institute
Curated by ChEMBL
LigandPNGBDBM50243726((7R,9S)-7-(((3S,4R)-3-methyl-4-o-tolylpiperidin-1-...)
Affinity DataIC50:  5.70nM. Assay description: Antagonist activity at human ORL1 expressed in CHO cells assessed as effect on nociceptin-induced GTPgammaS binding
In DepthDetails ArticlePubMed