BDBM50246110 3-(2,4-dihydroxyphenyl)-5-(4-hydroxyphenyl)-N-(4-methoxyphenyl)-4,5-dihydro-1H-pyrazole-1-carbothioamide::CHEMBL472569
SMILES COc1ccc(NC(=S)N2N=C(CC2c2ccc(O)cc2)c2ccc(O)cc2O)cc1
InChI Key InChIKey=FFTLDDJXCOXDAJ-UHFFFAOYSA-N
Data  2 IC50
  Tab Delimited (TSV)   2D SDfile   Computed 3D by Vconf -m prep SDfile
Find this compound or compounds like it in BindingDB:
Activity Spreadsheet -- Enzyme Inhibition Constant Data from BindingDB
Found 2 hits for monomerid = 50246110
TargetAmine oxidase [flavin-containing] A(Rattus norvegicus (rat))
Institute Of Technology
Curated by ChEMBL
LigandPNGBDBM50246110(3-(2,4-dihydroxyphenyl)-5-(4-hydroxyphenyl)-N-(4-m...)
Affinity DataIC50:  6.96E+4nM. Assay description: Inhibition of MAOA in rat liver homogenates preincubated for 60 mins
In DepthDetails ArticlePubMed
TargetAmine oxidase [flavin-containing] B(Rattus norvegicus (rat))
Institute Of Technology
Curated by ChEMBL
LigandPNGBDBM50246110(3-(2,4-dihydroxyphenyl)-5-(4-hydroxyphenyl)-N-(4-m...)
Affinity DataIC50:  4.56E+5nM. Assay description: Inhibition of MAOB in rat liver homogenates preincubated for 60 mins
In DepthDetails ArticlePubMed