BDBM50248646 2,6-dichloro-N-((1-(propylsulfonyl)-4-(pyridin-2-yl)piperidin-4-yl)methyl)benzamide::CHEMBL464087
SMILES CCCS(=O)(=O)N1CCC(CNC(=O)c2c(Cl)cccc2Cl)(CC1)c1ccccn1
InChI Key InChIKey=ZVCDXGSTNXMBJT-UHFFFAOYSA-N
Data  3 IC50
  Tab Delimited (TSV)   2D SDfile   Computed 3D by Vconf -m prep SDfile
Find this compound or compounds like it in BindingDB:
Activity Spreadsheet -- Enzyme Inhibition Constant Data from BindingDB
Found 3 hits for monomerid = 50248646
TargetSodium- and chloride-dependent glycine transporter 1(Homo sapiens (Human))
Merck
Curated by ChEMBL
LigandPNGBDBM50248646(2,6-dichloro-N-((1-(propylsulfonyl)-4-(pyridin-2-y...)
Affinity DataIC50:  6.60nM. Assay description: Inhibition of human glycine transporter 1
In DepthDetails ArticlePubMed
TargetSodium- and chloride-dependent taurine transporter(Homo sapiens (Human))
Merck
Curated by ChEMBL
LigandPNGBDBM50248646(2,6-dichloro-N-((1-(propylsulfonyl)-4-(pyridin-2-y...)
Affinity DataIC50: >3.00E+4nM. Assay description: Inhibition of taurine transporter
In DepthDetails ArticlePubMed
TargetSodium- and chloride-dependent glycine transporter 2(Homo sapiens (Human))
Merck
Curated by ChEMBL
LigandPNGBDBM50248646(2,6-dichloro-N-((1-(propylsulfonyl)-4-(pyridin-2-y...)
Affinity DataIC50: >3.00E+4nM. Assay description: Inhibition of glycine transporter 2
In DepthDetails ArticlePubMed