BDBM50248955 3-((1-(4-methylbenzyl)piperidin-4-yl)methyl)benzo[d]oxazol-2(3H)-one::3-[[1-(4-Methylbenzyl)piperidin-4-yl]methyl]benzo[d]oxazol-2(3H)-one::CHEMBL474565
SMILES Cc1ccc(CN2CCC(Cn3c4ccccc4oc3=O)CC2)cc1
InChI Key InChIKey=UWUQHVIAGSHCBA-UHFFFAOYSA-N
Data  2 KI
  Tab Delimited (TSV)   2D SDfile   Computed 3D by Vconf -m prep SDfile
Find this compound or compounds like it in BindingDB:
Activity Spreadsheet -- Enzyme Inhibition Constant Data from BindingDB
Found 2 hits for monomerid = 50248955
TargetSigma non-opioid intracellular receptor 1(RAT)
University Of Trieste
Curated by ChEMBL
LigandPNGBDBM50248955(3-((1-(4-methylbenzyl)piperidin-4-yl)methyl)benzo[...)
Affinity DataKi:  2.90nM. Assay description: Displacement of [3H](+)-pentazocine from sigma 1 receptor in rat liver membrane
In DepthDetails ArticlePubMed
TargetSigma non-opioid intracellular receptor 1(RAT)
University Of Trieste
Curated by ChEMBL
LigandPNGBDBM50248955(3-((1-(4-methylbenzyl)piperidin-4-yl)methyl)benzo[...)
Affinity DataKi:  3.07nM. Assay description: Displacement of [3H](+)-pentazocine from sigma1 receptor in rat liver membrane by liquid scintillation counting
In DepthDetails ArticlePubMed