BDBM50250142 CHEMBL4091233
SMILES ONC(=O)CCCCCCC(=O)Nc1ccc(CCCn2cc(cn2)-c2ncnc3[nH]ccc23)cc1
InChI Key InChIKey=XUDWZNDDTLRWKX-UHFFFAOYSA-N
Data  3 IC50  1 Kd
  Tab Delimited (TSV)   2D SDfile   Computed 3D by Vconf -m prep SDfile
Find this compound or compounds like it in BindingDB:
Activity Spreadsheet -- Enzyme Inhibition Constant Data from BindingDB
Found 4 hits for monomerid = 50250142
TargetHistone deacetylase 1(Homo sapiens (Human))
National University Of Singapore
Curated by ChEMBL
LigandPNGBDBM50250142(CHEMBL4091233)
Affinity DataIC50:  265nM. Assay description: Inhibition of C-terminal FLAG His tagged full length human recombinant HDAC1 (1 to 482 residues) expressed in baculovirus infected sf21 cells using R...
In DepthDetails ArticlePubMed
TargetTyrosine-protein kinase JAK2(Homo sapiens (Human))
National University Of Singapore
Curated by ChEMBL
LigandPNGBDBM50250142(CHEMBL4091233)
Affinity DataIC50:  865nM. Assay description: Inhibition of human recombinant HDAC3 (1 to 428 residues)/N-terminal GST-tagged NCOR2 (395 to 489 residues) expressed in Baculovirus infected insect ...
In DepthDetails ArticlePubMed
TargetHistone deacetylase 6(Homo sapiens (Human))
National University Of Singapore
Curated by ChEMBL
LigandPNGBDBM50250142(CHEMBL4091233)
Affinity DataIC50:  0.900nM. Assay description: Inhibition of N-terminal GST tagged human HDAC6 (1 to 1215 residues) expressed in baculovirus infected insect cells using RHKKAc as substrate in pres...
In DepthDetails ArticlePubMed
TargetTyrosine-protein kinase JAK2(Homo sapiens (Human))
National University Of Singapore
Curated by ChEMBL
LigandPNGBDBM50250142(CHEMBL4091233)
Affinity DataKd:  2.00E+3nM. Assay description: Binding affinity to N-terminal His tagged human recombinant JAK2 (1014 to 1132 residues) expressed in Escherichia coli after 60 to 90 mins by LC/MS a...
In DepthDetails ArticlePubMed