BDBM50251834 CHEMBL4061653
SMILES C(NC1CCc2c(C1)[nH]c1ccccc21)c1ccccc1
InChI Key InChIKey=KMOKEVFNTNVAQP-UHFFFAOYSA-N
Data  1 IC50
  Tab Delimited (TSV)   2D SDfile   Computed 3D by Vconf -m prep SDfile
Find this compound or compounds like it in BindingDB:
Activity Spreadsheet -- Enzyme Inhibition Constant Data from BindingDB
Found 1 hit for monomerid = 50251834
TargetRetinoblastoma-associated protein(Homo sapiens (Human))
Padmashri Vikhe Patil College Of Arts
Curated by ChEMBL
LigandPNGBDBM50251834(CHEMBL4061653)
Affinity DataIC50:  6.92E+3nM. Assay description: Inhibition of retinoblastoma protein phosphorylation in human MDA-MB-231 cells after 16 hrs by Hoechst 33342 staining based fluorescence assay
In DepthDetails ArticlePubMed