BDBM50251837 CHEMBL4068744
SMILES CC1CCC(C1)NC1CCCc2c1[nH]c1ccc(cc21)[N+]([O-])=O
InChI Key InChIKey=JSGDWGPUTMTPQH-UHFFFAOYSA-N
Data  1 IC50
  Tab Delimited (TSV)   2D SDfile   Computed 3D by Vconf -m prep SDfile
Find this compound or compounds like it in BindingDB:
Activity Spreadsheet -- Enzyme Inhibition Constant Data from BindingDB
Found 1 hit for monomerid = 50251837
TargetRetinoblastoma-associated protein(Homo sapiens (Human))
Padmashri Vikhe Patil College Of Arts
Curated by ChEMBL
LigandPNGBDBM50251837(CHEMBL4068744)
Affinity DataIC50:  4.81E+3nM. Assay description: Inhibition of retinoblastoma protein phosphorylation in human MDA-MB-231 cells after 16 hrs by Hoechst 33342 staining based fluorescence assay
In DepthDetails ArticlePubMed