BDBM50251850 CHEMBL4077816
SMILES Cc1ccc(CNC2CCc3c(C2)[nH]c2ccccc32)cc1
InChI Key InChIKey=CPAIEIJZVFXFPO-UHFFFAOYSA-N
Data  1 IC50
  Tab Delimited (TSV)   2D SDfile   Computed 3D by Vconf -m prep SDfile
Find this compound or compounds like it in BindingDB:
Activity Spreadsheet -- Enzyme Inhibition Constant Data from BindingDB
Found 1 hit for monomerid = 50251850
TargetRetinoblastoma-associated protein(Homo sapiens (Human))
Padmashri Vikhe Patil College Of Arts
Curated by ChEMBL
LigandPNGBDBM50251850(CHEMBL4077816)
Affinity DataIC50:  4.10E+3nM. Assay description: Inhibition of retinoblastoma protein phosphorylation in human MDA-MB-231 cells after 16 hrs by Hoechst 33342 staining based fluorescence assay
In DepthDetails ArticlePubMed