BDBM50251862 4-[(3-Nitrobenzyl)thio]-7-(beta-D-ribofuranosyl)-7H-pyrrolo[2,3-d]pyrimidine::CHEMBL481151
SMILES OC[C@H]1O[C@H]([C@H](O)[C@@H]1O)n1ccc2c(SCc3cccc(c3)[N+]([O-])=O)ncnc12
InChI Key InChIKey=IOOHWYYUGBNCJS-ATNYBXOESA-N
Data  1 KI
  Tab Delimited (TSV)   2D SDfile   Computed 3D by Vconf -m prep SDfile
Find this compound or compounds like it in BindingDB:
Activity Spreadsheet -- Enzyme Inhibition Constant Data from BindingDB
Found 1 hit for monomerid = 50251862
TargetAdenosine kinase(Toxoplasma gondii)
University Of Georgia
Curated by ChEMBL
LigandPNGBDBM50251862(4-[(3-Nitrobenzyl)thio]-7-(beta-D-ribofuranosyl)-7...)
Affinity DataKi:  4.50E+4nM. Assay description: Binding affinity to purified Toxoplasma gondii adenosine kinase
In DepthDetails ArticlePubMed