BDBM50253059 CHEMBL4084749
SMILES CC(=O)c1cc([nH]n1)C(=O)N1CCC(C1)c1cc(cc(C)n1)-c1cnn(C)c1
InChI Key InChIKey=DXTOTRNBQCJEMI-UHFFFAOYSA-N
Data  1 IC50
  Tab Delimited (TSV)   2D SDfile   Computed 3D by Vconf -m prep SDfile
Find this compound or compounds like it in BindingDB:
Activity Spreadsheet -- Enzyme Inhibition Constant Data from BindingDB
Found 1 hit for monomerid = 50253059
TargetLysine-specific demethylase 5A(Homo sapiens (Human))
Genentech
Curated by ChEMBL
LigandPNGBDBM50253059(CHEMBL4084749)
Affinity DataIC50: >2.50E+4nM. Assay description: Inhibition of recombinant human N-terminal FLAG-tagged KDM5A expressed in baculovirus infected Sf9 insect cells using H3K4me3 peptide as substrate af...
Ligand InfoPC cidPC sid
In DepthDetails ArticlePubMed