BDBM50254115 CHEMBL4080589
SMILES CN(C)c1cccc2c(cccc12)S(=O)(=O)NCCCCCCN(C)[C@H]1[C@H](O)[C@@H](O)[C@@H](O)[C@H]1CO
InChI Key InChIKey=ZZSYNRUICILULX-OQYVTVKQSA-N
Data  1 KI
  Tab Delimited (TSV)   2D SDfile   Computed 3D by Vconf -m prep SDfile
Find this compound or compounds like it in BindingDB:
Activity Spreadsheet -- Enzyme Inhibition Constant Data from BindingDB
Found 1 hit for monomerid = 50254115
TargetLysosomal acid glucosylceramidase(Homo sapiens (Human))
Graz University Of Technology
Curated by ChEMBL
LigandPNGBDBM50254115(CHEMBL4080589)
Affinity DataKi:  1nM. Assay description: Competitive inhibition of recombinant beta-glucocerebrosidase (unknown origin) using 4-nitrophenyl beta-D-galactopyranoside as substrate pre-incubate...
In DepthDetails ArticlePubMed