BDBM502557 2-(S)- hydroxy-N- [4-(7- methoxy-1- methyl-8- trifluoromethyl- [1,2,4]triazolo[4,3- a]quinoxaline- 4-ylamino)- butyl]-3- methyl-::US11028090, Example 479
SMILES COc1cc2nc(NCCCCNC(=O)[C@@H](O)C(C)C)c3nnc(C)n3c2cc1C(F)(F)F
InChI Key InChIKey=DHPACALBVYAURX-KRWDZBQOSA-N
Data  1 IC50
  Tab Delimited (TSV)   2D SDfile   Computed 3D by Vconf -m prep SDfile
Find this compound or compounds like it in BindingDB:
Activity Spreadsheet -- Enzyme Inhibition Constant Data from BindingDB
Found 1 hit for monomerid = 502557
TargetBromodomain-containing protein 4(Homo sapiens (Human))
Dong Wha Pharm.
US Patent
LigandPNGBDBM502557(2-(S)- hydroxy-N- [4-(7- methoxy-1- methyl-8- trif...)
Affinity DataIC50:  5nM. Assay description: The following experiment was performed to evaluate the ability of [1,2,4]triazolo[4,3-a]quinoxaline derivative of the present invention to inhibit th...
Ligand InfoPC cidPC sid
In DepthDetails US Patent