BDBM50255802 4-(3N-(2-Amino-2-methyl-1-hydroxypropyl)propoxy)-9Hxanthen-9-one hydrochloride::CHEMBL479644
SMILES CC(C)(CO)NCCCOc1cccc2c1oc1ccccc1c2=O
InChI Key InChIKey=SORKDYKEGLPPNG-UHFFFAOYSA-N
Data  1 KI
  Tab Delimited (TSV)   2D SDfile   Computed 3D by Vconf -m prep SDfile
Find this compound or compounds like it in BindingDB:
Activity Spreadsheet -- Enzyme Inhibition Constant Data from BindingDB
Found 1 hit for monomerid = 50255802
TargetBeta-1 adrenergic receptor(Rattus norvegicus (Rat))
Jagiellonian University Medical College
Curated by ChEMBL
LigandPNGBDBM50255802(4-(3N-(2-Amino-2-methyl-1-hydroxypropyl)propoxy)-9...)
Affinity DataKi:  2.60E+3nM. Assay description: Displacement of [3H]CGP12177 from beta1 adrenergic receptor in rat cerebral cortex by liquid scintillation counting
In DepthDetails ArticlePubMed