BDBM50255976 (S)-2-cyclohexyl-2-(3-(3-(2,4,6-trichlorophenyl)ureido)-2-naphthamido)acetic acid::CHEMBL512527
SMILES OC(=O)[C@@H](NC(=O)c1cc2ccccc2cc1NC(=O)Nc1c(Cl)cc(Cl)cc1Cl)C1CCCCC1
InChI Key InChIKey=CTDGLQDIWIHFIA-QFIPXVFZSA-N
Data  2 IC50
  Tab Delimited (TSV)   2D SDfile   Computed 3D by Vconf -m prep SDfile
Find this compound or compounds like it in BindingDB:
Activity Spreadsheet -- Enzyme Inhibition Constant Data from BindingDB
Found 2 hits for monomerid = 50255976
TargetGlycogen phosphorylase, liver form(Homo sapiens (Human))
Glaxosmithkline
Curated by ChEMBL
LigandPNGBDBM50255976((S)-2-cyclohexyl-2-(3-(3-(2,4,6-trichlorophenyl)ur...)
Affinity DataIC50:  224nM. Assay description: Inhibition of human liver glycogen phosphorylase A in HepG2 cells assessed as forskolin-induced glycogenolysis
In DepthDetails ArticlePubMed
TargetGlycogen phosphorylase, liver form(Homo sapiens (Human))
Glaxosmithkline
Curated by ChEMBL
LigandPNGBDBM50255976((S)-2-cyclohexyl-2-(3-(3-(2,4,6-trichlorophenyl)ur...)
Affinity DataIC50:  65nM. Assay description: Inhibition of human liver glycogen phosphorylase A by fluorescence intensity endpoint assay in presence of glucose
In DepthDetails ArticlePubMed