BDBM50256331 1-(3-(3-mesitylureido)-2-naphthamido)-4-oxocyclohexanecarboxylic acid::CHEMBL519942
SMILES Cc1cc(C)c(NC(=O)Nc2cc3ccccc3cc2C(=O)NC2(CCC(=O)CC2)C(O)=O)c(C)c1
InChI Key InChIKey=ZUUGDISHVJEEMF-UHFFFAOYSA-N
Data  1 IC50
  Tab Delimited (TSV)   2D SDfile   Computed 3D by Vconf -m prep SDfile
Find this compound or compounds like it in BindingDB:
Activity Spreadsheet -- Enzyme Inhibition Constant Data from BindingDB
Found 1 hit for monomerid = 50256331
TargetGlycogen phosphorylase, liver form(Homo sapiens (Human))
Glaxosmithkline
Curated by ChEMBL
LigandPNGBDBM50256331(1-(3-(3-mesitylureido)-2-naphthamido)-4-oxocyclohe...)
Affinity DataIC50:  1.15E+3nM. Assay description: Inhibition of human liver glycogen phosphorylase A by fluorescence intensity endpoint assay in presence of glucose
In DepthDetails ArticlePubMed