BDBM50256443 (S)-2-(3-(3-mesitylureido)-2-naphthamido)pentanoic acid::CHEMBL475765
SMILES CCC[C@H](NC(=O)c1cc2ccccc2cc1NC(=O)Nc1c(C)cc(C)cc1C)C(O)=O
InChI Key InChIKey=FZTWCIHSJDWTMS-NRFANRHFSA-N
Data  3 IC50
  Tab Delimited (TSV)   2D SDfile   Computed 3D by Vconf -m prep SDfile
Find this compound or compounds like it in BindingDB:
Activity Spreadsheet -- Enzyme Inhibition Constant Data from BindingDB
Found 3 hits for monomerid = 50256443
TargetGlycogen phosphorylase, liver form(Homo sapiens (Human))
Glaxosmithkline
Curated by ChEMBL
LigandPNGBDBM50256443((S)-2-(3-(3-mesitylureido)-2-naphthamido)pentanoic...)
Affinity DataIC50:  1.02E+3nM. Assay description: Inhibition of liver glycogen phosphorylase A in human HepG2 cells assessed as inhibition of forskolin-induced glucogenolysis
In DepthDetails ArticlePubMed
TargetGlycogen phosphorylase, liver form(Homo sapiens (Human))
Glaxosmithkline
Curated by ChEMBL
LigandPNGBDBM50256443((S)-2-(3-(3-mesitylureido)-2-naphthamido)pentanoic...)
Affinity DataIC50:  39nM. Assay description: Inhibition of human liver glycogen phosphorylase A by fluorescence plate reader assay
In DepthDetails ArticlePubMed
TargetCytochrome P450 2C9(Homo sapiens (Human))
Glaxosmithkline
Curated by ChEMBL
LigandPNGBDBM50256443((S)-2-(3-(3-mesitylureido)-2-naphthamido)pentanoic...)
Affinity DataIC50:  8.40E+3nM. Assay description: Inhibition of CYP2C9 (unknown origin)
In DepthDetails ArticlePubMed