BDBM50256523 2-(3-(3-mesitylureido)-2-naphthamido)heptanoic acid::CHEMBL481336
SMILES CCCCCC(NC(=O)c1cc2ccccc2cc1NC(=O)Nc1c(C)cc(C)cc1C)C(O)=O
InChI Key InChIKey=OYKMUKPYVKVTGY-UHFFFAOYSA-N
Data  2 IC50
  Tab Delimited (TSV)   2D SDfile   Computed 3D by Vconf -m prep SDfile
Find this compound or compounds like it in BindingDB:
Activity Spreadsheet -- Enzyme Inhibition Constant Data from BindingDB
Found 2 hits for monomerid = 50256523
TargetGlycogen phosphorylase, liver form(Homo sapiens (Human))
Glaxosmithkline
Curated by ChEMBL
LigandPNGBDBM50256523(2-(3-(3-mesitylureido)-2-naphthamido)heptanoic aci...)
Affinity DataIC50:  114nM. Assay description: Inhibition of human liver glycogen phosphorylase A by fluorescence plate reader assay
In DepthDetails ArticlePubMed
TargetGlycogen phosphorylase, liver form(Homo sapiens (Human))
Glaxosmithkline
Curated by ChEMBL
LigandPNGBDBM50256523(2-(3-(3-mesitylureido)-2-naphthamido)heptanoic aci...)
Affinity DataIC50:  1.53E+3nM. Assay description: Inhibition of liver glycogen phosphorylase A in human HepG2 cells assessed as inhibition of forskolin-induced glucogenolysis
In DepthDetails ArticlePubMed